{"text_format":"3","workbook":"xlsx","n_sheets":5,"sheets":["Instructions","Database","Analysis","Evidence gap map","Definitions"],"not_rendered":{"charts":11,"images":58,"macros":1,"defined_names":10,"comments":1},"read":"whole","date_system":"1900"}

{"sheet":"Instructions","index":0,"n_rows":26,"n_cols":1,"rows_kept":26}
["International Rules and  Norms Evidence Mapping Database"]
["Instructions"]
[]
["1. Background"]
[]
["The objective of this evidence mapping exercise was to identify and organise empirical evidence about the ways in which international rules and norms translate into action in low- and middle-income countries and lead to improved outcomes for freedom and democracy. This database is the result of a structured search of the literature to identify relevant primary studies and systematic reviews."]
[]
["2. What this database contains"]
[]
["Database page: A list of all of the documents selected from the rigorous review, which can be filtered according to various criteria. Details of the search strategy and inclusion criteria are documented separately."]
{"$rows_left_out":17}
{"sheet":"Database","index":1,"n_rows":178,"n_cols":74,"rows_kept":178,"merged":[[0,0,1,1],[0,12,0,14],[0,15,0,16],[0,17,0,19],[0,21,0,23],[0,24,0,28],[0,29,0,31],[0,32,0,37],[0,38,0,47],[0,48,0,55],[0,56,0,66],[0,67,0,73]]}
[{"$f":"Instructions!A1","v":"International Rules and  Norms Evidence Mapping Database"},{"$nulls":11},"Research design",null,null,"Research type",null,"Research method",{"$nulls":3},"Publication form",null,null,"Publisher",{"$nulls":4},"Quality appraisal score",null,null,"Thematic focus",{"$nulls":5},"Geographic focus",{"$nulls":9},"Norm carriers and consensus mechanisms",{"$nulls":7},"Outcomes",{"$nulls":10},"Enforcement mechanisms"]
[{"$nulls":11},"Total count",{"$f":"COUNTA(M6:M4994)","v":2},5,167,78,101,13,86,24,null,{"$f":"COUNTA(V6:V4994)","v":137},6,30,144,16,1,4,9,79,88,6,43,36,29,54,15,19,92,17,25,17,11,1,3,4,0,null,{"$f":"COUNTA(AW6:AW4994)","v":135},65,20,54,6,25,9,null,{"$f":"COUNTA(BE6:BE4994)","v":76},54,93,29,26,22,13,19,2,0,null,{"$f":"COUNTA(BP6:BP4994)","v":27},25,40,10,6,0,0]
[{"$nulls":11},"Count after applying filter",{"$f":"SUBTOTAL(3,M6:M4994)","v":2},5,167,78,101,13,86,24,null,{"$f":"SUBTOTAL(3,V6:V4994)","v":137},6,30,144,16,1,4,9,79,88,6,43,36,29,54,15,19,92,17,25,17,11,1,3,4,0,null,{"$f":"SUBTOTAL(3,AW6:AW4994)","v":135},65,20,54,6,25,9,null,{"$f":"SUBTOTAL(3,BE6:BE4994)","v":76},54,93,29,26,22,13,19,2,0,null,{"$f":"SUBTOTAL(3,BP6:BP4994)","v":27},25,40,10,6,0,0]
["Number of items catalogued:",{"$f":"COUNTA(A6:A4994)","v":173},{"$nulls":9},"Proportion of documents after applying filter",{"$f":"IFERROR(M3/M2,\"N/A\")","v":{"v":1,"d":"100%"}},{"$f":"IFERROR(N3/N2,\"N/A\")","v":{"v":1,"d":"100%"}},{"v":1,"d":"100%"},{"v":1,"d":"100%"},{"v":1,"d":"100%"},{"v":1,"d":"100%"},{"v":1,"d":"100%"},{"v":1,"d":"100%"},null,{"v":1,"d":"100%"},{"$f":"IFERROR(W3/W2,\"N/A\")","v":{"v":1,"d":"100%"}},{"v":1,"d":"100%"},{"v":1,"d":"100%"},{"v":1,"d":"100%"},{"v":1,"d":"100%"},{"v":1,"d":"100%"},{"v":1,"d":"100%"},{"v":1,"d":"100%"},{"v":1,"d":"100%"},{"v":1,"d":"100%"},{"v":1,"d":"100%"},{"v":1,"d":"100%"},{"v":1,"d":"100%"},{"v":1,"d":"100%"},{"v":1,"d":"100%"},{"v":1,"d":"100%"},{"v":1,"d":"100%"},{"v":1,"d":"100%"},{"v":1,"d":"100%"},{"v":1,"d":"100%"},{"v":1,"d":"100%"},{"v":1,"d":"100%"},{"v":1,"d":"100%"},{"v":1,"d":"100%"},"N/A",null,{"$f":"IFERROR(AW3/AW2,\"N/A\")","v":{"v":1,"d":"100%"}},{"v":1,"d":"100%"},{"v":1,"d":"100%"},{"v":1,"d":"100%"},{"v":1,"d":"100%"},{"v":1,"d":"100%"},{"v":1,"d":"100%"},null,{"$f":"IFERROR(BE3/BE2,\"N/A\")","v":{"v":1,"d":"100%"}},{"v":1,"d":"100%"},{"v":1,"d":"100%"},{"v":1,"d":"100%"},{"v":1,"d":"100%"},{"v":1,"d":"100%"},{"v":1,"d":"100%"},{"v":1,"d":"100%"},{"v":1,"d":"100%"},"N/A",null,{"$f":"IFERROR(BP3/BP2,\"N/A\")","v":{"v":1,"d":"100%"}},{"v":1,"d":"100%"},{"v":1,"d":"100%"},{"v":1,"d":"100%"},{"v":1,"d":"100%"},"N/A","N/A"]
["Author/s","Year","Title","Journal/Book Name/Series Name","Location published","Publisher/Institution","Vol","Issue","Pages","Abstract/Summary","Key finding","URL","Experimental","Quasi-experimental","Observational","Primary research study","Secondary research study","Quantitative","Qualitative","Mixed methods","Other (free text)","Peer-reviewed journal","Evaluation","Expert report","Academic organisation/think-tank","Multilateral, bilateral or intergovernmental org","National/host government organisation","Non-governmental organisation","Private/commercial organisation","High quality","Moderate quality","Low quality","Gender & civil rights","Gender & political participation","Gender & employment rights","Financial crime & money laundering","Financial crime & tax","LGBTQI+","Transnational","Middle East and North Africa","Sub-Saharan Africa","Asia","Europe","North America","South America","Latin America and the Caribbean","Oceania","Countries (free text)","International organisations","National and local government","Private sector","Civil society","Media","Activists / spokespersons","Household / community","Other (free text)","International formal commitments","International led/funded programmes","Domestic formal commitments","Domestic led/funded programmes","Mobilisation/advocacy","Attitude/behaviour change","Unclear","Mixed","Outcome blank 1","Outcome blank 2","Other (free text)","Donor funding","Membership","Negative press","Sanctions","Other","Enforcement blank 1","Enforcement blank 2"]
["Aantjes, C., Munguambe, K. Muchanga, V., Capurchande, R. & Poku, N.K.",2022,"‘Why Doesn't the Decriminalisation of Same-Sex Sexuality and Sex Work Ensure Rights? The Legality and Social Acceptance of Transgressive Sexualities in Urban Mozambique.","Sexuality Research and Social Policy",null,null,19,null,"416-431","The dependence on the law to direct people’s behaviour is known for its imperfections, yet it has become a mainstream response to social problems in modern day society. It is also the pathway through which internationally-recognised rights obligations, including sexual rights, are anticipated to diffuse across distinctly different societies. We studied the introduction of new legal standards in Mozambique, with an interest in their ability to promote the rights of lesbian, gay, bisexual, transgender, intersex (LGBTI) people and sex workers. Methods: Between 2019 and 2020, we conducted sixteen key informant interviews with jurists, policymakers, and civil society advocates at national level and seventy-eight interviews with opinion leaders from local communities in three urban sites situated across Northern, Central, and Southern Mozambique. Results: The new legal standards, in which same-sex sexuality and sex work are no longer criminalised, found little resonance with intersecting religious, sexual, gender, and socio-cultural norms. Whilst there was a consensus not to discriminate, sensitisation and rehabilitation of LGBTI people and sex workers were considered imperative. This stance, coupled with a continued presence of ambiguous language in and incongruences between legislative pieces, attenuates the country’s commitment to internationally recognised rights obligations. Conclusions: In a context of weak civilian awareness and support, the legal reforms are not likely to make a profound positive impact on the lives of LGBTI people and sex workers. Policy action should extend beyond health and law enforcement institutions and draw in community leaders to mediate the social processes that undercut the universality of rights.","As international rights obligations fnd their codifcation in domestic laws and policies, there needs to be a real engagement with the public and with the underlying moral issues that may hinder their acceptance. The case of Mozambique illustrates the uphill battle for legal norms that remain distant from the public, due to the lack of popularisation in the society and their tension with social norms, as relayed by opinion leaders residing in different parts of the country. This places the onerous task of claiming a legitimate social standing on civil society pressure groups and individual LGBTI and sex workers, and attenuates the country’s commitment to the universality of rights. The exemplary step of breaking away from an inherited law which classifed certain sexual activities as crimes now needs to be supported by interventions which combat the stigma and discrimination against LGBTI people and sex workers and encourage their social inclusion and acceptance in Mozambique.","https://link.springer.com/article/10.1007/s13178-021-00554-1",null,null,"x","x",null,null,"x",null,null,"x",null,null,"x",{"$nulls":4},"x",{"$nulls":7},"x",{"$nulls":9},"Mozambique",null,"x",{"$nulls":8},"x"]
["Acosta, M., Van Bommel, S., van Wessel, M., Ampaire,E.l.,  Jassogne,L., & Feindt, P.L.",2019,"Discursive Translations of Gender Mainstreaming Norms: The Case of Agricultural and Climate Change Policies in Uganda","Women's Studies International Forum",null,null,74,null,"9-19","While the international norm on gender mainstreaming, UN-backed since 1995, has been widely adopted in national policies, gender inequalities are rarely systematically addressed on the ground. To explain this limited effectiveness, this paper takes a discourse analytical perspective on gender policy and budgeting, with a focus on the translation of the international norm into domestic norms and policies. An in-depth, inductive analysis of 107 policy documents in Uganda examines how the gender mainstreaming norm has been translated at three administrative levels: national, district, sub-county. The analysis finds five processes that reduce the norm's transformational potential: neglecting gender discourse, gender inertia, shrinking gender norms, embracing discursive hybridity and minimizing budgets. Overall, gender mainstreaming largely stopped at the discursive level, and often paradoxically depoliticized gender. The findings explain why gender mainstreaming might be helpful but not sufficient for advancing gender equality and suggest additional focus on promising practices, women's rights movements and stronger monitoring",null,"https://www.sciencedirect.com/science/article/pii/S0277539518304771",null,null,"x","x",null,null,"x",null,null,"x",null,null,"x",{"$nulls":5},"x",{"$nulls":3},"x",{"$nulls":5},"x",{"$nulls":6},"Uganda","x","x",{"$nulls":7},"x","x"]
["Adams, M., & Kang, A.",2007,"Regional Advocacy Networks and The Protocol on The Rights of Women in Africa","Politics and Gender",null,null,3,null,"452-474","While there has been a significant amount of research on transnational feminist activism at the global level, many feminist transnational advocacy networks are mobilizing within world regions. The lack of attention to the regional level has created a considerable imbalance in research on transnational activism. This article's first objective is to define regional advocacy networks (RANs) as a collection of individuals and organizations from the same world region working together toward a common goal. The article's second objective is to explore the conditions under which RANs are influential. We investigate conditions for RAN success through a case study of an African network that hdped create one of the world's most progressive treaties on women's rights, the African Union Protocol to the Charter on Human and People's Rights on the Rights of Women in Africa. From an analysis of primary sources and interviews with key participants, we suggest that three factors are crucial for network success: whether a RAN builds alliances with key politicians and civil servants, whether a RAN is able to participate in the decision-making process, and whether a RAN's goals overlap with the target institution's priorities. The broader implication of our study is that scholars seeking to understand the creation of women's rights commitments, the diffusion of women's rights norms, and compliance",null,"https://digitalcommons.unl.edu/cgi/viewcontent.cgi?article=1043&context=poliscifacpub",null,null,"x","x",null,null,"x",null,null,"x",null,null,"x",{"$nulls":4},"x",null,null,"x",{"$nulls":7},"x",{"$nulls":10},"x",null,"x",null,"Regional advocacy networks","x",null,"x",null,"x"]
["Agarwal, J.D. & Agarwal, A.",2004,"International Money Laundering in The Banking Centre","Finance India","Delhi ",null,18,2,"767-778","Money laundering worldwide through the banking sector is estimated to be between $500 billion and $1 trillion annually with about half of that circulated through US banks. In India, the Government had already issued anti-money laundering guidelines before introduction of a Bill in this regard and an RBI panel had also recommended rules for unproving procedures and policies. Electronic transfers greatly facilitated and magnified the size and dimension of international money laundering where banks are directly involved. Philippine banking industry could have avoided a repeat of the scandal involving the Bank of Credit and Commerce International. The IMF and World Bank should adopt a more comprehensive and integrated approach to conduct assessments of compliance with international standards for fighting money laundering.","Banks play a criital role in facilitating money laundering","https://www.proquest.com/docview/224378157?parentSessionId=%2BU2ulVDR3Ol1o%2BKWNuN8xOsi1YKXPlphbMeHxsnob6Q%3D",null,null,"x",null,"x",{"$nulls":3},"x",null,null,"x",{"$nulls":4},"x",null,"x",{"$nulls":4},"x",null,null,"x",{"$nulls":11},"x",{"$nulls":12},"x",{"$nulls":5},"x"]
["Aguayo‐Tellez, E.",2012,"The Impact of Trade Liberalization Policies and FDI On Gender Inequalities: A Literature Review. ",null,null,"World Bank",{"$nulls":3},"This paper reviews the recent literature on the impact of Trade Liberalization and FDI on gender inequality in employment, wages, education, health and other dimensions of welfare in both developed and developing countries.",null,"https://openknowledge.worldbank.org/handle/10986/9220",null,null,"x","x",{"$nulls":3},"x",{"$nulls":3},"x",null,"x",{"$nulls":4},"x",{"$nulls":3},"x",{"$nulls":3},"x",{"$nulls":9},"x","x",{"$nulls":6},"x","x",{"$nulls":3},"x"]
{"$rows_left_out":169}
{"sheet":"Analysis","index":2,"n_rows":84,"n_cols":3,"rows_kept":84,"merged":[[7,0,8,0],[7,2,8,2]]}
[{"$f":"Instructions!A1","v":"International Rules and  Norms Evidence Mapping Database"}]
["Analysis"]
[]
["Tick the box next to each criterion to select items related to that criterion.  When multiple boxes are ticked, only items that satisfy all criteria are selected."]
["When you first open this spreadsheet, you might need to click the 'reset all filters' button before beginning to make any selections."]
["Switch back to the 'Database' page to see the publications that have been selected."]
[]
["Number of documents included by the current combination of filters:",null,{"$f":"SUBTOTAL(3,Database!A6:A4994)","v":173}]
[]
[]
{"$rows_left_out":75}
{"sheet":"Evidence gap map","index":3,"n_rows":39,"n_cols":7,"rows_kept":39,"merged":[[7,1,7,6],[17,1,17,6],[30,1,30,6]]}
[{"$f":"Instructions!A1","v":"International Rules and  Norms Evidence Mapping Database"}]
["Evidence gap map"]
[]
["This table shows the number of studies included in this review that addressed each combination of interventions and outcomes. "]
["Green cells show where the review found a significant number of studies - darker shades of green indicate more studies found.  Red cells highlight evidence gaps - darker shades of red indicate greater evidence gaps."]
["The evidence gap map is not affected by filters selected on the other pages of the spreadsheet; it shows the total number of studies in the database related to each combination of intervention and outcome."]
[]
[null,"Thematic focus"]
[{"$f":"Database!AW1","v":"Norm carriers and consensus mechanisms"},{"$f":"Database!$AG$5","v":"Gender & civil rights"},{"$f":"Database!$AH$5","v":"Gender & political participation"},{"$f":"Database!$AI$5","v":"Gender & employment rights"},{"$f":"Database!$AJ$5","v":"Financial crime & money laundering"},{"$f":"Database!$AK$5","v":"Financial crime & tax"},{"$f":"Database!$AL$5","v":"LGBTQI+"}]
[{"$f":"Database!AW$5","v":"International organisations"},{"$f":"COUNTIFS(Database!$AW$6:$AW$4994,\">''\",Theme_1_data,\">''\")","v":30},{"$f":"COUNTIFS(Database!$AW$6:$AW$4994,\">''\",Theme_2_data,\">''\")","v":28},{"$f":"COUNTIFS(Database!$AW$6:$AW$4994,\">''\",Theme_3_data,\">''\")","v":18},{"$f":"COUNTIFS(Database!$AW$6:$AW$4994,\">''\",Theme_4_data,\">''\")","v":47},{"$f":"COUNTIFS(Database!$AW$6:$AW$4994,\">''\",Theme_5_data,\">''\")","v":14},{"$f":"COUNTIFS(Database!$AW$6:$AW$4994,\">''\",Theme_6_data,\">''\")","v":16}]
{"$rows_left_out":30}
{"sheet":"Definitions","index":4,"n_rows":41,"n_cols":1,"rows_kept":41,"merged":[[14,0,14,1],[31,0,31,1]]}
[{"$f":"Instructions!A1","v":"International Rules and  Norms Evidence Mapping Database"}]
["Definitions"]
[]
["Norm carriers"]
[]
["Dialogue"]
["Learning"]
["Global media"]
["Civil society"]
["Activism"]
{"$rows_left_out":31}